{"text_format":"1","workbook":"xlsx","n_sheets":5,"sheets":["Summary","Consol Data","Company 1","Company 2","Master"],"not_rendered":{"charts":0,"images":0,"macros":1,"external_links":0,"defined_names":1,"comments":0,"pivot_tables":1},"unopened":[],"bounds":{"document_bytes":16777216,"sheet_cells":100000,"rows_first":2000,"rows_last":500,"rows_between":2000,"halvings":0,"cell_chars":16384,"cell_head_chars":4096},"cells_cut":0,"cells_raw":0,"read":"whole","date_system":"1900"}

{"sheet":"Summary","index":0,"n_rows":35,"n_cols":4,"rows_kept":35,"cut":false,"hidden":false,"merged":[]}
["Fin Object","BS"]
[]
["Fin Group","Master Group","Parent Group","Sum of Net Amount"]
["Asset","Assets","Fixed Assets",-39600]
[null,null,"Loans & Advances (Asset)",-105129.16]
[null,"Assets Total",null,-144729.16]
[null,"Current Assets","Bank Accounts",-169549.88]
[null,null,"Cash-in-hand",-50848]
[null,null,"GST Maharashtra",-3206359.52]
[null,null,"Loans & Advances (Asset)",-144668]
[null,null,"Prepaid Expenses",-130621.23999999999]
[null,null,"Securities & Deposits (Asset)",-100000]
[null,null,"Stock-in-hand",-11610222.560000001]
[null,null,"Sundry Debtors",-19707159.93]
[null,null,"Suspense Account",29477]
[null,"Current Assets Total",null,-35089952.129999995]
["Asset Total",null,null,-35234681.289999999]
["Equity","Capital","Current Capital",-1175000]
[null,null,"Fixed Capital",20000]
[null,null,"Profit & Loss",-457751.16]
[null,null,"Salary - Partners Remuneration",-2600000]
[null,"Capital Total",null,-4212751.16]
["Equity Total",null,null,-4212751.16]
["Liabilities","Current Liabilities","Duties & Taxes",2824456.4299999997]
[null,null,"Loans (Liability)",7347000]
[null,null,"Sundry Creditors",23141971.710000001]
[null,"Current Liabilities Total",null,33313428.140000001]
[null,"Provisions ","PF F.Y. 22-23",100301]
[null,null,"Provisions/Expenses Payable",664728.68000000005]
[null,null,"Reimbursement Expenses Payable",368276]
[null,null,"Salary Payable",1233136]
[null,null,"TDS F.Y. 2022-23",101788]
[null,"Provisions  Total",null,2468229.6800000002]
["Liabilities Total",null,null,35781657.82]
["Grand Total",null,null,-3665774.6299999952]

{"sheet":"Consol Data","index":1,"n_rows":887,"n_cols":6,"rows_kept":887,"cut":false,"hidden":false,"merged":[]}
["Accounts","Net Amount","Parent Group","Master Group","Fin Group","Fin Object"]
["Absolute Skin Clinic",1519,{"$f":"VLOOKUP(A2,Master!A:B,2,FALSE)","v":"Sundry Debtors"},{"$f":"VLOOKUP(A2,Master!A:C,3,FALSE)","v":"Current Assets"},{"$f":"VLOOKUP(A2,Master!A:D,4,FALSE)","v":"Asset"},{"$f":"VLOOKUP(A2,Master!A:E,5,FALSE)","v":"BS"}]
["Agarwal Textile LLP",9000,{"$f":"VLOOKUP(A3,Master!A:B,2,FALSE)","v":"Fixed Capital"},{"$f":"VLOOKUP(A3,Master!A:C,3,FALSE)","v":"Capital"},{"$f":"VLOOKUP(A3,Master!A:D,4,FALSE)","v":"Equity"},{"$f":"VLOOKUP(A3,Master!A:E,5,FALSE)","v":"BS"}]
["Aishwarya (Dr Rashmi Patil)",-1800,{"$f":"VLOOKUP(A4,Master!A:B,2,FALSE)","v":"Sundry Debtors"},{"$f":"VLOOKUP(A4,Master!A:C,3,FALSE)","v":"Current Assets"},{"$f":"VLOOKUP(A4,Master!A:D,4,FALSE)","v":"Asset"},{"$f":"VLOOKUP(A4,Master!A:E,5,FALSE)","v":"BS"}]
["Ajay Nigam",-11736,{"$f":"VLOOKUP(A5,Master!A:B,2,FALSE)","v":"Reimbursement Expenses Payable"},{"$f":"VLOOKUP(A5,Master!A:C,3,FALSE)","v":"Provisions "},{"$f":"VLOOKUP(A5,Master!A:D,4,FALSE)","v":"Liabilities"},{"$f":"VLOOKUP(A5,Master!A:E,5,FALSE)","v":"BS"}]
["Amaanza Technologies (Dr Rashmi Dubey )",-28800,{"$f":"VLOOKUP(A6,Master!A:B,2,FALSE)","v":"Sundry Debtors"},{"$f":"VLOOKUP(A6,Master!A:C,3,FALSE)","v":"Current Assets"},{"$f":"VLOOKUP(A6,Master!A:D,4,FALSE)","v":"Asset"},{"$f":"VLOOKUP(A6,Master!A:E,5,FALSE)","v":"BS"}]
["Anita Chemist",-358,{"$f":"VLOOKUP(A7,Master!A:B,2,FALSE)","v":"Sundry Debtors"},{"$f":"VLOOKUP(A7,Master!A:C,3,FALSE)","v":"Current Assets"},{"$f":"VLOOKUP(A7,Master!A:D,4,FALSE)","v":"Asset"},{"$f":"VLOOKUP(A7,Master!A:E,5,FALSE)","v":"BS"}]
["Ankit Singh",-31697,{"$f":"VLOOKUP(A8,Master!A:B,2,FALSE)","v":"Salary Payable"},{"$f":"VLOOKUP(A8,Master!A:C,3,FALSE)","v":"Provisions "},{"$f":"VLOOKUP(A8,Master!A:D,4,FALSE)","v":"Liabilities"},{"$f":"VLOOKUP(A8,Master!A:E,5,FALSE)","v":"BS"}]
["Antil Clinic",-34800,{"$f":"VLOOKUP(A9,Master!A:B,2,FALSE)","v":"Sundry Debtors"},{"$f":"VLOOKUP(A9,Master!A:C,3,FALSE)","v":"Current Assets"},{"$f":"VLOOKUP(A9,Master!A:D,4,FALSE)","v":"Asset"},{"$f":"VLOOKUP(A9,Master!A:E,5,FALSE)","v":"BS"}]
["Arham Packaging",87554,{"$f":"VLOOKUP(A10,Master!A:B,2,FALSE)","v":"Sundry Creditors"},{"$f":"VLOOKUP(A10,Master!A:C,3,FALSE)","v":"Current Liabilities"},{"$f":"VLOOKUP(A10,Master!A:D,4,FALSE)","v":"Liabilities"},{"$f":"VLOOKUP(A10,Master!A:E,5,FALSE)","v":"BS"}]
["Aroma Remedies",159166,{"$f":"VLOOKUP(A11,Master!A:B,2,FALSE)","v":"Sundry Creditors"},{"$f":"VLOOKUP(A11,Master!A:C,3,FALSE)","v":"Current Liabilities"},{"$f":"VLOOKUP(A11,Master!A:D,4,FALSE)","v":"Liabilities"},{"$f":"VLOOKUP(A11,Master!A:E,5,FALSE)","v":"BS"}]
["Arsh Family Dental & Cosmetology Care",-10800,{"$f":"VLOOKUP(A12,Master!A:B,2,FALSE)","v":"Sundry Debtors"},{"$f":"VLOOKUP(A12,Master!A:C,3,FALSE)","v":"Current Assets"},{"$f":"VLOOKUP(A12,Master!A:D,4,FALSE)","v":"Asset"},{"$f":"VLOOKUP(A12,Master!A:E,5,FALSE)","v":"BS"}]
["Arth Medical",-5000,{"$f":"VLOOKUP(A13,Master!A:B,2,FALSE)","v":"Sundry Debtors"},{"$f":"VLOOKUP(A13,Master!A:C,3,FALSE)","v":"Current Assets"},{"$f":"VLOOKUP(A13,Master!A:D,4,FALSE)","v":"Asset"},{"$f":"VLOOKUP(A13,Master!A:E,5,FALSE)","v":"BS"}]
["Athens Life Sciences",-9867,{"$f":"VLOOKUP(A14,Master!A:B,2,FALSE)","v":"Sundry Creditors"},{"$f":"VLOOKUP(A14,Master!A:C,3,FALSE)","v":"Current Liabilities"},{"$f":"VLOOKUP(A14,Master!A:D,4,FALSE)","v":"Liabilities"},{"$f":"VLOOKUP(A14,Master!A:E,5,FALSE)","v":"BS"}]
["Auro Skin Clinic & Pharmacy",-8900,{"$f":"VLOOKUP(A15,Master!A:B,2,FALSE)","v":"Sundry Debtors"},{"$f":"VLOOKUP(A15,Master!A:C,3,FALSE)","v":"Current Assets"},{"$f":"VLOOKUP(A15,Master!A:D,4,FALSE)","v":"Asset"},{"$f":"VLOOKUP(A15,Master!A:E,5,FALSE)","v":"BS"}]
["Bad Debts Provision",263661.84000000003,{"$f":"VLOOKUP(A16,Master!A:B,2,FALSE)","v":"Provisions/Expenses Payable"},{"$f":"VLOOKUP(A16,Master!A:C,3,FALSE)","v":"Provisions "},{"$f":"VLOOKUP(A16,Master!A:D,4,FALSE)","v":"Liabilities"},{"$f":"VLOOKUP(A16,Master!A:E,5,FALSE)","v":"BS"}]
["BodySutra  Skin, Hair & Nail Clinic",-4000,{"$f":"VLOOKUP(A17,Master!A:B,2,FALSE)","v":"Sundry Debtors"},{"$f":"VLOOKUP(A17,Master!A:C,3,FALSE)","v":"Current Assets"},{"$f":"VLOOKUP(A17,Master!A:D,4,FALSE)","v":"Asset"},{"$f":"VLOOKUP(A17,Master!A:E,5,FALSE)","v":"BS"}]
["Borolkar Medical Stores",-81681,{"$f":"VLOOKUP(A18,Master!A:B,2,FALSE)","v":"Sundry Debtors"},{"$f":"VLOOKUP(A18,Master!A:C,3,FALSE)","v":"Current Assets"},{"$f":"VLOOKUP(A18,Master!A:D,4,FALSE)","v":"Asset"},{"$f":"VLOOKUP(A18,Master!A:E,5,FALSE)","v":"BS"}]
["BPQ Health Care Services Private Limited",-42480,{"$f":"VLOOKUP(A19,Master!A:B,2,FALSE)","v":"Sundry Debtors"},{"$f":"VLOOKUP(A19,Master!A:C,3,FALSE)","v":"Current Assets"},{"$f":"VLOOKUP(A19,Master!A:D,4,FALSE)","v":"Asset"},{"$f":"VLOOKUP(A19,Master!A:E,5,FALSE)","v":"BS"}]
["Brijesh Rajbhar",-270,{"$f":"VLOOKUP(A20,Master!A:B,2,FALSE)","v":"Reimbursement Expenses Payable"},{"$f":"VLOOKUP(A20,Master!A:C,3,FALSE)","v":"Provisions "},{"$f":"VLOOKUP(A20,Master!A:D,4,FALSE)","v":"Liabilities"},{"$f":"VLOOKUP(A20,Master!A:E,5,FALSE)","v":"BS"}]
["C.H Aman Medical & General Stores",-1523,{"$f":"VLOOKUP(A21,Master!A:B,2,FALSE)","v":"Sundry Debtors"},{"$f":"VLOOKUP(A21,Master!A:C,3,FALSE)","v":"Current Assets"},{"$f":"VLOOKUP(A21,Master!A:D,4,FALSE)","v":"Asset"},{"$f":"VLOOKUP(A21,Master!A:E,5,FALSE)","v":"BS"}]
["C/o Viva Aesthetic",-17630,{"$f":"VLOOKUP(A22,Master!A:B,2,FALSE)","v":"Sundry Debtors"},{"$f":"VLOOKUP(A22,Master!A:C,3,FALSE)","v":"Current Assets"},{"$f":"VLOOKUP(A22,Master!A:D,4,FALSE)","v":"Asset"},{"$f":"VLOOKUP(A22,Master!A:E,5,FALSE)","v":"BS"}]
["Capitalg Healthcare MultiVentures PvtLtd",-5593,{"$f":"VLOOKUP(A23,Master!A:B,2,FALSE)","v":"Sundry Debtors"},{"$f":"VLOOKUP(A23,Master!A:C,3,FALSE)","v":"Current Assets"},{"$f":"VLOOKUP(A23,Master!A:D,4,FALSE)","v":"Asset"},{"$f":"VLOOKUP(A23,Master!A:E,5,FALSE)","v":"BS"}]
["Cash",-10875,{"$f":"VLOOKUP(A24,Master!A:B,2,FALSE)","v":"Cash-in-hand"},{"$f":"VLOOKUP(A24,Master!A:C,3,FALSE)","v":"Current Assets"},{"$f":"VLOOKUP(A24,Master!A:D,4,FALSE)","v":"Asset"},{"$f":"VLOOKUP(A24,Master!A:E,5,FALSE)","v":"BS"}]
["CGST Input",-2686.41,{"$f":"VLOOKUP(A25,Master!A:B,2,FALSE)","v":"Duties & Taxes"},{"$f":"VLOOKUP(A25,Master!A:C,3,FALSE)","v":"Current Liabilities"},{"$f":"VLOOKUP(A25,Master!A:D,4,FALSE)","v":"Liabilities"},{"$f":"VLOOKUP(A25,Master!A:E,5,FALSE)","v":"BS"}]
["CGST Output",667.64,{"$f":"VLOOKUP(A26,Master!A:B,2,FALSE)","v":"Duties & Taxes"},{"$f":"VLOOKUP(A26,Master!A:C,3,FALSE)","v":"Current Liabilities"},{"$f":"VLOOKUP(A26,Master!A:D,4,FALSE)","v":"Liabilities"},{"$f":"VLOOKUP(A26,Master!A:E,5,FALSE)","v":"BS"}]
["Chaudhrey Davakhana",-12674,{"$f":"VLOOKUP(A27,Master!A:B,2,FALSE)","v":"Sundry Debtors"},{"$f":"VLOOKUP(A27,Master!A:C,3,FALSE)","v":"Current Assets"},{"$f":"VLOOKUP(A27,Master!A:D,4,FALSE)","v":"Asset"},{"$f":"VLOOKUP(A27,Master!A:E,5,FALSE)","v":"BS"}]
["Citi Clinic",-7990,{"$f":"VLOOKUP(A28,Master!A:B,2,FALSE)","v":"Sundry Debtors"},{"$f":"VLOOKUP(A28,Master!A:C,3,FALSE)","v":"Current Assets"},{"$f":"VLOOKUP(A28,Master!A:D,4,FALSE)","v":"Asset"},{"$f":"VLOOKUP(A28,Master!A:E,5,FALSE)","v":"BS"}]
["Cosmoderm Pharmacy",-8750,{"$f":"VLOOKUP(A29,Master!A:B,2,FALSE)","v":"Sundry Debtors"},{"$f":"VLOOKUP(A29,Master!A:C,3,FALSE)","v":"Current Assets"},{"$f":"VLOOKUP(A29,Master!A:D,4,FALSE)","v":"Asset"},{"$f":"VLOOKUP(A29,Master!A:E,5,FALSE)","v":"BS"}]
["Dande  Medicals",-10248,{"$f":"VLOOKUP(A30,Master!A:B,2,FALSE)","v":"Sundry Debtors"},{"$f":"VLOOKUP(A30,Master!A:C,3,FALSE)","v":"Current Assets"},{"$f":"VLOOKUP(A30,Master!A:D,4,FALSE)","v":"Asset"},{"$f":"VLOOKUP(A30,Master!A:E,5,FALSE)","v":"BS"}]
["Derma Care Skin Clinic",-3360,{"$f":"VLOOKUP(A31,Master!A:B,2,FALSE)","v":"Sundry Debtors"},{"$f":"VLOOKUP(A31,Master!A:C,3,FALSE)","v":"Current Assets"},{"$f":"VLOOKUP(A31,Master!A:D,4,FALSE)","v":"Asset"},{"$f":"VLOOKUP(A31,Master!A:E,5,FALSE)","v":"BS"}]
["Dermaessentia Skin Store",-12972,{"$f":"VLOOKUP(A32,Master!A:B,2,FALSE)","v":"Sundry Debtors"},{"$f":"VLOOKUP(A32,Master!A:C,3,FALSE)","v":"Current Assets"},{"$f":"VLOOKUP(A32,Master!A:D,4,FALSE)","v":"Asset"},{"$f":"VLOOKUP(A32,Master!A:E,5,FALSE)","v":"BS"}]
["Dermaplast Aesthetic Clinic",-6000,{"$f":"VLOOKUP(A33,Master!A:B,2,FALSE)","v":"Sundry Debtors"},{"$f":"VLOOKUP(A33,Master!A:C,3,FALSE)","v":"Current Assets"},{"$f":"VLOOKUP(A33,Master!A:D,4,FALSE)","v":"Asset"},{"$f":"VLOOKUP(A33,Master!A:E,5,FALSE)","v":"BS"}]
["Dr Aiman Munshi",-1160,{"$f":"VLOOKUP(A34,Master!A:B,2,FALSE)","v":"Sundry Debtors"},{"$f":"VLOOKUP(A34,Master!A:C,3,FALSE)","v":"Current Assets"},{"$f":"VLOOKUP(A34,Master!A:D,4,FALSE)","v":"Asset"},{"$f":"VLOOKUP(A34,Master!A:E,5,FALSE)","v":"BS"}]
["Dr Ajay Nimbalkar",-1984,{"$f":"VLOOKUP(A35,Master!A:B,2,FALSE)","v":"Sundry Debtors"},{"$f":"VLOOKUP(A35,Master!A:C,3,FALSE)","v":"Current Assets"},{"$f":"VLOOKUP(A35,Master!A:D,4,FALSE)","v":"Asset"},{"$f":"VLOOKUP(A35,Master!A:E,5,FALSE)","v":"BS"}]
["Dr Alfiya  Lakdawala",-2625,{"$f":"VLOOKUP(A36,Master!A:B,2,FALSE)","v":"Sundry Debtors"},{"$f":"VLOOKUP(A36,Master!A:C,3,FALSE)","v":"Current Assets"},{"$f":"VLOOKUP(A36,Master!A:D,4,FALSE)","v":"Asset"},{"$f":"VLOOKUP(A36,Master!A:E,5,FALSE)","v":"BS"}]
["Dr Amol Bagadia",-15000,{"$f":"VLOOKUP(A37,Master!A:B,2,FALSE)","v":"Sundry Debtors"},{"$f":"VLOOKUP(A37,Master!A:C,3,FALSE)","v":"Current Assets"},{"$f":"VLOOKUP(A37,Master!A:D,4,FALSE)","v":"Asset"},{"$f":"VLOOKUP(A37,Master!A:E,5,FALSE)","v":"BS"}]
["Dr Anjana Gala",-54,{"$f":"VLOOKUP(A38,Master!A:B,2,FALSE)","v":"Sundry Debtors"},{"$f":"VLOOKUP(A38,Master!A:C,3,FALSE)","v":"Current Assets"},{"$f":"VLOOKUP(A38,Master!A:D,4,FALSE)","v":"Asset"},{"$f":"VLOOKUP(A38,Master!A:E,5,FALSE)","v":"BS"}]
["Dr Antima Saxena",-1050,{"$f":"VLOOKUP(A39,Master!A:B,2,FALSE)","v":"Sundry Debtors"},{"$f":"VLOOKUP(A39,Master!A:C,3,FALSE)","v":"Current Assets"},{"$f":"VLOOKUP(A39,Master!A:D,4,FALSE)","v":"Asset"},{"$f":"VLOOKUP(A39,Master!A:E,5,FALSE)","v":"BS"}]
["Dr Aparna A.Patil",1636,{"$f":"VLOOKUP(A40,Master!A:B,2,FALSE)","v":"Sundry Debtors"},{"$f":"VLOOKUP(A40,Master!A:C,3,FALSE)","v":"Current Assets"},{"$f":"VLOOKUP(A40,Master!A:D,4,FALSE)","v":"Asset"},{"$f":"VLOOKUP(A40,Master!A:E,5,FALSE)","v":"BS"}]
{"$rows_left_out":848}
{"sheet":"Company 1","index":2,"n_rows":318,"n_cols":5,"rows_kept":318,"cut":false,"hidden":false,"merged":[]}
["Co 1"]
["Opening Balance"]
["As On : 01-04-2024"]
["Account","Parent Group","Debit Bal.","Credit Bal.","Net"]
["Absolute Skin Clinic","Sundry Debtors",null,1519,1519]
["Agarwal Textile LLP","Fixed Capital",null,9000,9000]
["Aishwarya (Dr Rashmi Patil)","Sundry Debtors",1800,null,-1800]
["Ajay Nigam","Reimbursement Expenses Payable",11736,null,-11736]
["Amaanza Technologies (Dr Rashmi Dubey )","Sundry Debtors",28800,null,-28800]
["Anita Chemist","Sundry Debtors",358,null,-358]
["Ankit Singh","Salary Payable",31697,null,-31697]
["Antil Clinic","Sundry Debtors",34800,null,-34800]
["Arham Packaging","Sundry Creditors",null,87554,87554]
["Aroma Remedies","Sundry Creditors",null,159166,159166]
["Arsh Family Dental & Cosmetology Care","Sundry Debtors",10800,null,-10800]
["Arth Medical","Sundry Debtors",5000,null,-5000]
["Athens Life Sciences","Sundry Creditors",9867,null,-9867]
["Auro Skin Clinic & Pharmacy","Sundry Debtors",8900,null,-8900]
["Bad Debts Provision","Provisions/Expenses Payable",null,263661.84000000003,263661.84000000003]
["BodySutra  Skin, Hair & Nail Clinic","Sundry Debtors",4000,null,-4000]
["Borolkar Medical Stores","Sundry Debtors",81681,null,-81681]
["BPQ Health Care Services Private Limited","Sundry Debtors",42480,null,-42480]
["Brijesh Rajbhar","Reimbursement Expenses Payable",270,null,-270]
["C.H Aman Medical & General Stores","Sundry Debtors",1523,null,-1523]
["C/o Viva Aesthetic","Sundry Debtors",17630,null,-17630]
["Capitalg Healthcare MultiVentures PvtLtd","Sundry Debtors",5593,null,-5593]
["Cash","Cash-in-hand",10875,null,-10875]
["CGST Input","GST Maharashtra",2686.41,null,-2686.41]
["CGST Output","GST Maharashtra",null,667.64,667.64]
["Chaudhrey Davakhana","Sundry Debtors",12674,null,-12674]
["Citi Clinic","Sundry Debtors",7990,null,-7990]
["Cosmoderm Pharmacy","Sundry Debtors",8750,null,-8750]
["Dande  Medicals","Sundry Debtors",10248,null,-10248]
["Derma Care Skin Clinic","Sundry Debtors",3360,null,-3360]
["Dermaessentia Skin Store","Sundry Debtors",12972,null,-12972]
["Dermaplast Aesthetic Clinic","Sundry Debtors",6000,null,-6000]
["Dr Aiman Munshi","Sundry Debtors",1160,null,-1160]
["Dr Ajay Nimbalkar","Sundry Debtors",1984,null,-1984]
["Dr Alfiya  Lakdawala","Sundry Debtors",2625,null,-2625]
["Dr Amol Bagadia","Sundry Debtors",15000,null,-15000]
{"$rows_left_out":279}
{"sheet":"Company 2","index":3,"n_rows":576,"n_cols":5,"rows_kept":576,"cut":false,"hidden":false,"merged":[]}
["Co 2"]
["Trial Balance"]
["As On : 31-03-2024"]
["Account","Parent Group","Debit Bal.","Credit Bal.","Net"]
["A.B Chemist & Druggist","Sundry Debtors",2016,null,-2016]
["Aadi Chemist","Sundry Debtors",1572,null,-1572]
["Aadi Skin Hair Cosmetic & Laser Clinic","Sundry Debtors",30300,null,-30300]
["Aayusparsh Skin Hair Clinic","Sundry Debtors",5000,null,-5000]
["Abhishek Singi","Sundry Creditors",null,45000,45000]
["Abhishek Singi Expenses Payable","Reimbursement Expenses Payable",null,50000,50000]
["Absolute Skin Clinic","Sundry Debtors",10191,null,-10191]
["Accounting & Consultancy Charges","Expenses (Indirect/Admn.)",162950,null,-162950]
["Accounting Fee Provision","Provisions/Expenses Payable",null,25000,25000]
["Adil Noori","Salary Payable",null,29323,29323]
["Adiraj Clinic","Sundry Debtors",13650,null,-13650]
["Administration Charges","Expenses (Indirect/Admn.)",26318,null,-26318]
["Advertisement & Publicity","Expenses (Indirect/Admn.)",35292.01,null,-35292.01]
["Aftab Alam Qureshi","Salary Payable",null,53208,53208]
["Aftab Qureshi Expense Payable","Reimbursement Expenses Payable",null,9200,9200]
["Agarwal Textile LLP","Fixed Capital",null,9000,9000]
["Ageless Clinic Private Ltd","Sundry Debtors",null,15350,15350]
["Aishwarya (Dr Rashmi Patil)","Sundry Debtors",1800,null,-1800]
["Ajay Nigam","Reimbursement Expenses Payable",11736,null,-11736]
["Ajeet Diwedi","Salary Payable",null,15505,15505]
["Akshara Health Care Foundaton","Sundry Debtors",15452,null,-15452]
["Al Ahmad Medical","Sundry Debtors",1928,null,-1928]
["Alana Clinic","Sundry Debtors",10050,null,-10050]
["Alana Skin Hair & Laser Clinic","Sundry Debtors",8400,null,-8400]
["All Staff Expenses Payable Provisions","Reimbursement Expenses Payable",null,267974,267974]
["Alpha Chemist","Sundry Debtors",9200,null,-9200]
["Anika Medical Store","Sundry Debtors",3495,null,-3495]
["Anil Chagan Dange","Reimbursement Expenses Payable",3000,null,-3000]
["Anita Chemist","Sundry Debtors",248,null,-248]
["Ankit Singh","Salary Payable",null,12424,12424]
["Ankit Singh Expenses Payable","Reimbursement Expenses Payable",47550,null,-47550]
["Anmol Neeraj Shrivastav","Sundry Creditors",null,90000,90000]
["Antil Clinic","Sundry Debtors",13950,null,-13950]
["Anushka Wilson","Sundry Debtors",3000,null,-3000]
["AR Healthcare","Sundry Debtors",21750,null,-21750]
["Aroma Remedies","Sundry Creditors",6422.18,null,-6422.18]
{"$rows_left_out":537}
{"sheet":"Master","index":4,"n_rows":777,"n_cols":5,"rows_kept":777,"cut":false,"hidden":false,"merged":[]}
["Account","Parent Group","Master Group","Fin Group","Fin Object"]
["2020 Production","Sundry Debtors","Current Assets","Asset","BS"]
["A R ENTERPRISE","Sundry Debtors","Current Assets","Asset","BS"]
["A S FABRICATORS","Sundry Debtors","Current Assets","Asset","BS"]
["ADHARSH ENTERPRISES","Sundry Debtors","Current Assets","Asset","BS"]
["Amazon Andaman Nicobar","Sundry Debtors","Current Assets","Asset","BS"]
["Amazon Andhra Pradesh","Sundry Debtors","Current Assets","Asset","BS"]
["Amazon Arunanchal Pradesh","Sundry Debtors","Current Assets","Asset","BS"]
["Amazon Assam","Sundry Debtors","Current Assets","Asset","BS"]
["Amazon Bihar","Sundry Debtors","Current Assets","Asset","BS"]
["Amazon Chandigarh","Sundry Debtors","Current Assets","Asset","BS"]
["Amazon Chhattisgarh","Sundry Debtors","Current Assets","Asset","BS"]
["Amazon Dadar Nagar Haveli","Sundry Debtors","Current Assets","Asset","BS"]
["Amazon Daman Div","Sundry Debtors","Current Assets","Asset","BS"]
["Amazon Delhi","Sundry Debtors","Current Assets","Asset","BS"]
["Amazon Goa","Sundry Debtors","Current Assets","Asset","BS"]
["Amazon Gujrat","Sundry Debtors","Current Assets","Asset","BS"]
["Amazon Haryana","Sundry Debtors","Current Assets","Asset","BS"]
["Amazon Himanchal Pradesh","Sundry Debtors","Current Assets","Asset","BS"]
["Amazon Jammu Kashmir","Sundry Debtors","Current Assets","Asset","BS"]
["Amazon Jharkhand","Sundry Debtors","Current Assets","Asset","BS"]
["Amazon Karnataka","Sundry Debtors","Current Assets","Asset","BS"]
["Amazon Kerala","Sundry Debtors","Current Assets","Asset","BS"]
["Amazon Ladak","Sundry Debtors","Current Assets","Asset","BS"]
["Amazon Madhya Pradesh","Sundry Debtors","Current Assets","Asset","BS"]
["Amazon Maharashtra","Sundry Debtors","Current Assets","Asset","BS"]
["Amazon Manipur","Sundry Debtors","Current Assets","Asset","BS"]
["Amazon Meghalaya","Sundry Debtors","Current Assets","Asset","BS"]
["AMAZON MIZORAM","Sundry Debtors","Current Assets","Asset","BS"]
["Amazon Nagaland","Sundry Debtors","Current Assets","Asset","BS"]
["Amazon Odisha","Sundry Debtors","Current Assets","Asset","BS"]
["Amazon Puducherry","Sundry Debtors","Current Assets","Asset","BS"]
["Amazon Punjab","Sundry Debtors","Current Assets","Asset","BS"]
["Amazon Rajasthan","Sundry Debtors","Current Assets","Asset","BS"]
["Amazon Seller Services Pvt Ltd. karnatak","Sundry Creditors","Current Liabilities","Liabilities","BS"]
["Amazon Sikkim","Sundry Debtors","Current Assets","Asset","BS"]
["Amazon Tamil Nadu","Sundry Debtors","Current Assets","Asset","BS"]
["Amazon Telangana","Sundry Debtors","Current Assets","Asset","BS"]
["Amazon Tripura","Sundry Debtors","Current Assets","Asset","BS"]
["Amazon Uttar Pradesh","Sundry Debtors","Current Assets","Asset","BS"]
{"$rows_left_out":737}